{"text_format":"1","workbook":"xlsx","n_sheets":6,"sheets":["事業所情報","入力_印刷","①","②","③","Sheet1"],"not_rendered":{"charts":0,"images":1,"macros":1,"external_links":0,"defined_names":2,"comments":0,"pivot_tables":0},"unopened":[],"bounds":{"document_bytes":16777216,"sheet_cells":100000,"rows_first":2000,"rows_last":500,"rows_between":2000,"halvings":0,"cell_chars":16384,"cell_head_chars":4096},"cells_cut":0,"cells_raw":0,"read":"whole","date_system":"1900"}

{"sheet":"事業所情報","index":0,"n_rows":8,"n_cols":4,"rows_kept":8,"cut":false,"hidden":false,"merged":[]}
["事業所情報"]
[null,"事業所番号",9876,{"$f":"REPT(\" \",7-LEN(C2))&C2","v":"   9876"}]
[null,"事業所名","ABC株式会社"]
[null,"郵便番号","123-4567"]
[null,"住所","山形県○○市○○３丁目２０番５号"]
[null,"代表者肩書き","代表取締役社長"]
[null,"代表者名","山田　太郎"]
[null,"電話番号","02-3232-1234"]

{"sheet":"入力_印刷","index":1,"n_rows":154,"n_cols":25,"rows_kept":154,"cut":false,"hidden":false,"merged":[[0,7,1,9],[2,0,3,0],[2,23,3,23],[2,1,3,1],[2,2,3,2],[2,3,3,3],[2,4,3,4],[2,11,3,11],[2,5,2,6],[2,7,2,8],[2,9,2,10],[3,13,3,22]]}
[null,"印刷指定",null,null,"届出に記載される提出日","2020-04-20",null,"氏名変更届"]
[null,1]
["通し\n番号","加入者番号","生年月日","性別","変更年月日","変更後氏名（カナ）",null,"変更後氏名（漢字）",null,"変更前氏名",null,"備考",null,null,null,null,null,null,null,null,null,null,null,"記入チェック","提出確認"]
[null,null,null,null,null,"(氏）","（名）","(氏）","（名）","（氏）","（名）",null,null,"加入員番号",null,null,null,null,null,null,null,null,null,null,"こちらはチェック用です、届出に記載されるのはF1のものです"]
[1,12345,"1977-09-21","男","2020-04-01","タナカ","イチロウ","田中","一郎","山本","一郎",null,{"$f":"REPT(\" \",10-LEN(B5))&B5","v":"     12345"},{"$f":"IF(LEN(B5)=10,MID(M5,1,1),\"\")","v":""},{"$f":"IF(LEN(B5)>=9,MID(M5,2,1),\"\")","v":""},{"$f":"IF(LEN(B5)>=8,MID(M5,3,1),\"\")","v":""},{"$f":"IF(LEN(B5)>=7,MID(M5,4,1),\"\")","v":""},{"$f":"IF(LEN(B5)>=6,MID(M5,5,1),\"\")","v":""},{"$f":"IF(LEN(B5)>=5,MID(M5,6,1),\"\")","v":"1"},{"$f":"IF(LEN(B5)>=4,MID(M5,7,1),\"\")","v":"2"},{"$f":"IF(LEN(B5)>=3,MID(M5,8,1),\"\")","v":"3"},{"$f":"IF(LEN(B5)>=2,MID(M5,9,1),\"\")","v":"4"},{"$f":"IF(LEN(B5)>=1,MID(M5,10,1),\"\")","v":"5"},{"$f":"IF(TYPE(A5)=2,\"\",IF(COUNTBLANK(B5:K5)>0,\"記入漏れがあります\",\"\"))","v":""},"2020-04-23"]
[{"$f":"IF(TYPE(F6)=2,+A5+1,\"\")","v":2},6789,"1980-05-10","女","2020-04-15","ナカヤマ","ユミ","中山","由美","鈴木","由美","結婚",{"$f":"REPT(\" \",10-LEN(B6))&B6","v":"      6789"},{"$f":"IF(LEN(B6)=10,MID(M6,1,1),\"\")","v":""},{"$f":"IF(LEN(B6)>=9,MID(M6,2,1),\"\")","v":""},{"$f":"IF(LEN(B6)>=8,MID(M6,3,1),\"\")","v":""},{"$f":"IF(LEN(B6)>=7,MID(M6,4,1),\"\")","v":""},{"$f":"IF(LEN(B6)>=6,MID(M6,5,1),\"\")","v":""},{"$f":"IF(LEN(B6)>=5,MID(M6,6,1),\"\")","v":""},{"$f":"IF(LEN(B6)>=4,MID(M6,7,1),\"\")","v":"6"},{"$f":"IF(LEN(B6)>=3,MID(M6,8,1),\"\")","v":"7"},{"$f":"IF(LEN(B6)>=2,MID(M6,9,1),\"\")","v":"8"},{"$f":"IF(LEN(B6)>=1,MID(M6,10,1),\"\")","v":"9"},"","2020-04-23"]
[{"$f":"IF(TYPE(F7)=2,+A6+1,\"\")","v":""},null,null,null,null,null,null,null,null,null,null,null,{"$f":"REPT(\" \",10-LEN(B7))&B7","v":"          "},{"$f":"IF(LEN(B7)=10,MID(M7,1,1),\"\")","v":""},{"$f":"IF(LEN(B7)>=9,MID(M7,2,1),\"\")","v":""},{"$f":"IF(LEN(B7)>=8,MID(M7,3,1),\"\")","v":""},{"$f":"IF(LEN(B7)>=7,MID(M7,4,1),\"\")","v":""},{"$f":"IF(LEN(B7)>=6,MID(M7,5,1),\"\")","v":""},{"$f":"IF(LEN(B7)>=5,MID(M7,6,1),\"\")","v":""},{"$f":"IF(LEN(B7)>=4,MID(M7,7,1),\"\")","v":""},{"$f":"IF(LEN(B7)>=3,MID(M7,8,1),\"\")","v":""},{"$f":"IF(LEN(B7)>=2,MID(M7,9,1),\"\")","v":""},{"$f":"IF(LEN(B7)>=1,MID(M7,10,1),\"\")","v":""},{"$f":"IF(TYPE(A7)=2,\"\",IF(COUNTBLANK(B7:K7)>0,\"記入漏れがあります\",\"\"))","v":""}]
["",null,null,null,null,null,null,null,null,null,null,null,"          ","","","","","","","","","","",""]
[{"$f":"IF(TYPE(F9)=2,+A8+1,\"\")","v":""},null,null,null,null,null,null,null,null,null,null,null,"          ","","","","","","","","","","",{"$f":"IF(TYPE(A9)=2,\"\",IF(COUNTBLANK(B9:K9)>0,\"記入漏れがあります\",\"\"))","v":""}]
["",null,null,null,null,null,null,null,null,null,null,null,"          ","","","","","","","","","","",""]
["",null,null,null,null,null,null,null,null,null,null,null,"          ","","","","","","","","","","",""]
["",null,null,null,null,null,null,null,null,null,null,null,"          ","","","","","","","","","","",""]
["",null,null,null,null,null,null,null,null,null,null,null,"          ","","","","","","","","","","",{"$f":"IF(TYPE(A13)=2,\"\",IF(COUNTBLANK(B13:K13)>0,\"記入漏れがあります\",\"\"))","v":""}]
["",null,null,null,null,null,null,null,null,null,null,null,"          ","","","","","","","","","","",""]
["",null,null,null,null,null,null,null,null,null,null,null,"          ","","","","","","","","","","",""]
["",null,null,null,null,null,null,null,null,null,null,null,"          ","","","","","","","","","","",""]
["",null,null,null,null,null,null,null,null,null,null,null,"          ","","","","","","","","","","",""]
["",null,null,null,null,null,null,null,null,null,null,null,"          ","","","","","","","","","","",{"$f":"IF(TYPE(A18)=2,\"\",IF(COUNTBLANK(B18:K18)>0,\"記入漏れがあります\",\"\"))","v":""}]
[{"$f":"IF(TYPE(F19)=2,+A18+1,\"\")","v":""},null,null,null,null,null,null,null,null,null,null,null,"          ","","","","","","","","","","",{"$f":"IF(TYPE(A19)=2,\"\",IF(COUNTBLANK(B19:K19)>0,\"記入漏れがあります\",\"\"))","v":""}]
[{"$f":"IF(TYPE(F20)=2,+A19+1,\"\")","v":""},null,null,null,null,null,null,null,null,null,null,null,"          ","","","","","","","","","","",""]
["",null,null,null,null,null,null,null,null,null,null,null,"          ","","","","","","","","","","",""]
["",null,null,null,null,null,null,null,null,null,null,null,"          ","","","","","","","","","","",""]
["",null,null,null,null,null,null,null,null,null,null,null,"          ","","","","","","","","","","",""]
["",null,null,null,null,null,null,null,null,null,null,null,"          ","","","","","","","","","","",""]
["",null,null,null,null,null,null,null,null,null,null,null,"          ","","","","","","","","","","",""]
["",null,null,null,null,null,null,null,null,null,null,null,"          ","","","","","","","","","","",""]
["",null,null,null,null,null,null,null,null,null,null,null,"          ","","","","","","","","","","",""]
["",null,null,null,null,null,null,null,null,null,null,null,"          ","","","","","","","","","","",""]
["",null,null,null,null,null,null,null,null,null,null,null,"          ","","","","","","","","","","",""]
["",null,null,null,null,null,null,null,null,null,null,null,"          ","","","","","","","","","","",""]
[{"$f":"IF(TYPE(F31)=2,+A30+1,\"\")","v":""},null,null,null,null,null,null,null,null,null,null,null,"          ","","","","","","","","","","",""]
["",null,null,null,null,null,null,null,null,null,null,null,"          ","","","","","","","","","","",""]
["",null,null,null,null,null,null,null,null,null,null,null,"          ","","","","","","","","","","",""]
["",null,null,null,null,null,null,null,null,null,null,null,"          ","","","","","","","","","","",""]
["",null,null,null,null,null,null,null,null,null,null,null,"          ","","","","","","","","","","",""]
["",null,null,null,null,null,null,null,null,null,null,null,"          ","","","","","","","","","","",""]
["",null,null,null,null,null,null,null,null,null,null,null,"          ","","","","","","","","","","",""]
["",null,null,null,null,null,null,null,null,null,null,null,"          ","","","","","","","","","","",""]
["",null,null,null,null,null,null,null,null,null,null,null,"          ","","","","","","","","","","",""]
["",null,null,null,null,null,null,null,null,null,null,null,"          ","","","","","","","","","","",""]
["",null,null,null,null,null,null,null,null,null,null,null,"          ","","","","","","","","","","",""]
["",null,null,null,null,null,null,null,null,null,null,null,"          ","","","","","","","","","","",""]
["",null,null,null,null,null,null,null,null,null,null,null,"          ","","","","","","","","","","",""]
["",null,null,null,null,null,null,null,null,null,null,null,"          ","","","","","","","","","","",""]
["",null,null,null,null,null,null,null,null,null,null,null,"          ","","","","","","","","","","",""]
["",null,null,null,null,null,null,null,null,null,null,null,"          ","","","","","","","","","","",""]
["",null,null,null,null,null,null,null,null,null,null,null,"          ","","","","","","","","","","",""]
["",null,null,null,null,null,null,null,null,null,null,null,"          ","","","","","","","","","","",""]
["",null,null,null,null,null,null,null,null,null,null,null,"          ","","","","","","","","","","",""]
["",null,null,null,null,null,null,null,null,null,null,null,"          ","","","","","","","","","","",""]
["",null,null,null,null,null,null,null,null,null,null,null,"          ","","","","","","","","","","",""]
["",null,null,null,null,null,null,null,null,null,null,null,"          ","","","","","","","","","","",""]
["",null,null,null,null,null,null,null,null,null,null,null,"          ","","","","","","","","","","",""]
["",null,null,null,null,null,null,null,null,null,null,null,"          ","","","","","","","","","","",""]
["",null,null,null,null,null,null,null,null,null,null,null,"          ","","","","","","","","","","",""]
["",null,null,null,null,null,null,null,null,null,null,null,"          ","","","","","","","","","","",""]
["",null,null,null,null,null,null,null,null,null,null,null,"          ","","","","","","","","","","",""]
["",null,null,null,null,null,null,null,null,null,null,null,"          ","","","","","","","","","","",""]
["",null,null,null,null,null,null,null,null,null,null,null,"          ","","","","","","","","","","",""]
["",null,null,null,null,null,null,null,null,null,null,null,"          ","","","","","","","","","","",""]
["",null,null,null,null,null,null,null,null,null,null,null,"          ","","","","","","","","","","",""]
["",null,null,null,null,null,null,null,null,null,null,null,"          ","","","","","","","","","","",""]
["",null,null,null,null,null,null,null,null,null,null,null,"          ","","","","","","","","","","",""]
["",null,null,null,null,null,null,null,null,null,null,null,"          ","","","","","","","","","","",""]
["",null,null,null,null,null,null,null,null,null,null,null,"          ","","","","","","","","","","",""]
["",null,null,null,null,null,null,null,null,null,null,null,"          ","","","","","","","","","","",""]
["",null,null,null,null,null,null,null,null,null,null,null,"          ","","","","","","","","","","",""]
["",null,null,null,null,null,null,null,null,null,null,null,"          ","","","","","","","","","","",""]
["",null,null,null,null,null,null,null,null,null,null,null,"          ","","","","","","","","","","",""]
["",null,null,null,null,null,null,null,null,null,null,null,"          ","","","","","","","","","","",""]
[{"$f":"IF(TYPE(F71)=2,+A70+1,\"\")","v":""},null,null,null,null,null,null,null,null,null,null,null,{"$f":"REPT(\" \",10-LEN(B71))&B71","v":"          "},{"$f":"IF(LEN(B71)=10,MID(M71,1,1),\"\")","v":""},{"$f":"IF(LEN(B71)>=9,MID(M71,2,1),\"\")","v":""},{"$f":"IF(LEN(B71)>=8,MID(M71,3,1),\"\")","v":""},{"$f":"IF(LEN(B71)>=7,MID(M71,4,1),\"\")","v":""},{"$f":"IF(LEN(B71)>=6,MID(M71,5,1),\"\")","v":""},{"$f":"IF(LEN(B71)>=5,MID(M71,6,1),\"\")","v":""},{"$f":"IF(LEN(B71)>=4,MID(M71,7,1),\"\")","v":""},{"$f":"IF(LEN(B71)>=3,MID(M71,8,1),\"\")","v":""},{"$f":"IF(LEN(B71)>=2,MID(M71,9,1),\"\")","v":""},{"$f":"IF(LEN(B71)>=1,MID(M71,10,1),\"\")","v":""},""]
["",null,null,null,null,null,null,null,null,null,null,null,"          ","","","","","","","","","","",""]
["",null,null,null,null,null,null,null,null,null,null,null,"          ","","","","","","","","","","",""]
["",null,null,null,null,null,null,null,null,null,null,null,"          ","","","","","","","","","","",""]
["",null,null,null,null,null,null,null,null,null,null,null,"          ","","","","","","","","","","",""]
["",null,null,null,null,null,null,null,null,null,null,null,"          ","","","","","","","","","","",""]
["",null,null,null,null,null,null,null,null,null,null,null,"          ","","","","","","","","","","",""]
["",null,null,null,null,null,null,null,null,null,null,null,"          ","","","","","","","","","","",""]
["",null,null,null,null,null,null,null,null,null,null,null,"          ","","","","","","","","","","",""]
["",null,null,null,null,null,null,null,null,null,null,null,"          ","","","","","","","","","","",""]
{"$rows_left_out":75}
{"sheet":"①","index":2,"n_rows":26,"n_cols":52,"rows_kept":26,"cut":false,"hidden":false,"merged":[[0,43,1,50],[22,34,22,44],[13,39,14,47],[0,6,1,20],[25,2,25,5],[9,4,9,5],[9,6,9,7],[10,2,10,7],[11,2,11,7],[21,6,21,19],[23,6,23,19],[25,6,25,17],[19,7,19,10],[10,10,10,16],[11,10,11,16],[21,2,21,5],[23,2,23,5],[0,2,0,5],[1,2,1,5],[9,2,9,3],[9,10,9,12],[9,8,9,9],[3,48,3,50],[4,36,5,38],[4,39,5,41],[11,19,11,25],[10,19,10,25],[4,48,5,50],[9,19,9,20],[5,13,5,19],[4,42,5,44],[3,42,3,44],[3,45,3,47],[10,26,10,29],[11,26,11,29],[3,39,3,41],[5,21,5,30],[3,36,3,38],[9,15,9,16],[4,45,5,47],[9,13,9,14],[19,2,19,5],[10,31,11,35],[10,37,11,42],[10,45,11,49],[4,7,4,11],[4,13,4,19],[4,21,4,30],[4,31,5,31],[7,2,7,9],[7,10,7,12],[7,13,7,20],[9,17,9,18]]}
[null,null,"企業年金",null,null,null,"加入者氏名変更（訂正）届",null,null,null,null,null,null,null,null,null,null,null,null,null,null,null,null,null,null,null,null,null,null,null,null,null,null,null,null,null,null,null,null,null,null,null,null,"企業年金基金用",null,null,null,null,null,null,null,1]
[null,null,"基　　金"]
[]
[null,null,null,null,null,null,null,null,null,null,null,null,null,null,null,null,null,null,null,null,null,null,null,null,null,null,null,null,null,null,null,null,null,null,null,null,"常務理事",null,null,"事務長",null,null,"課(係)長",null,null,null,null,null,"係"]
[null,null,null,null,null,null,null,"契約番号",null,null,null,null,null,"事業所番号",null,null,null,null,null,null,null,"加入者番号",null,null,null,null,null,null,null,null,null,"CD"]
[null,null,null,null,null,null,null,8,0,4,2,8,null,{"$f":"事業所情報!C2","v":9876},null,null,null,null,null,null,null,{"$f":"VLOOKUP(入力_印刷!B2,入力_印刷!$A$5:$B$154,2,FALSE)","v":12345}]
[]
[null,null,"生年月日",null,null,null,null,null,null,null,"性別",null,null,"変更年月日"]
[null,null,null,null,null,"年",null,"月",null,"日",null,null,null,null,null,null,"年",null,"月",null,"日"]
[null,null,{"$f":"LEFT(TEXT(VLOOKUP(入力_印刷!B2,入力_印刷!$A$5:$E$154,3,FALSE),\"yyyy\"),2)","v":"19"},null,{"$f":"TEXT(VLOOKUP(入力_印刷!B2,入力_印刷!$A$5:$C$154,3,FALSE),\"yy\")","v":"77"},null,{"$f":"MONTH(VLOOKUP(入力_印刷!B2,入力_印刷!$A$5:$C$154,3,FALSE))","v":9},null,{"$f":"DAY(VLOOKUP(入力_印刷!B2,入力_印刷!$A$5:$C$154,3,FALSE))","v":21},null,{"$f":"VLOOKUP(入力_印刷!B2,入力_印刷!A5:D154,4,FALSE)","v":"男"},null,null,{"$f":"LEFT(TEXT(VLOOKUP(入力_印刷!B2,入力_印刷!$A$5:$E$154,5,FALSE),\"yyyy\"),2)","v":"20"},null,{"$f":"TEXT(VLOOKUP(入力_印刷!B2,入力_印刷!$A$5:$E$154,5,FALSE),\"yy\")","v":"20"},null,{"$f":"MONTH(VLOOKUP(入力_印刷!B2,入力_印刷!$A$5:$E$154,5,FALSE))","v":4},null,{"$f":"DAY(VLOOKUP(入力_印刷!B2,入力_印刷!$A$5:$E$154,5,FALSE))","v":1}]
[null,null,"加入者の氏名",null,null,null,null,null,"（ﾌﾘｶﾞﾅ）",null,{"$f":"VLOOKUP(入力_印刷!B2,入力_印刷!$A$5:$F$154,6,FALSE)","v":"タナカ"},null,null,null,null,null,null,null,null,{"$f":"VLOOKUP(入力_印刷!B2,入力_印刷!$A$5:$G$154,7,FALSE)","v":"イチロウ"},null,null,null,null,null,null,"変更前の",null,null,null,"(氏）",{"$f":"VLOOKUP(入力_印刷!B2,入力_印刷!$A$5:$J$154,10,FALSE)","v":"山本"},null,null,null,null,"(名）",{"$f":"VLOOKUP(入力_印刷!B2,入力_印刷!$A$5:$K$154,11,FALSE)","v":"一郎"},null,null,null,null,null,"備　考",null,{"$f":"IF(VLOOKUP(入力_印刷!B2,入力_印刷!A4:L154,12,FALSE)=\"\",\"\",VLOOKUP(入力_印刷!B2,入力_印刷!A4:L154,12,FALSE))","v":""}]
[null,null,"（変更後）",null,null,null,null,null,"（氏）",null,{"$f":"VLOOKUP(入力_印刷!B2,入力_印刷!$A$5:$H$154,8,FALSE)","v":"田中"},null,null,null,null,null,null,"（名）",null,{"$f":"VLOOKUP(入力_印刷!B2,入力_印刷!$A$5:$I$154,9,FALSE)","v":"一郎"},null,null,null,null,null,null,"氏　　名"]
[]
[null,null,null,null,null,null,null,null,null,null,null,null,null,null,null,null,null,null,null,null,null,null,null,null,null,null,null,null,null,null,null,null,null,null,null,null,null,null,null,{"$f":"入力_印刷!F1","v":"2020-04-20"}]
[null,null,null,null,null,null,null,null,null,null,null,null,null,null,null,null,null,null,null,null,null,null,null,null,null,null,null,null,null,null,null,null,null,null,null,null,null,null,null,null,null,null,null,null,null,null,null,null,null,"提出"]
[]
[null,null,null,null,"Ｇ＆Ｅみらい企業年金基金理事長　殿"]
[]
[]
[null,null,"事業所所在地",null,null,null,"〒",{"$f":"事業所情報!C4","v":"123-4567"},null,null,null,{"$f":"事業所情報!C5","v":"山形県○○市○○３丁目２０番５号"}]
[]
[null,null,"事業所名称",null,null,null,{"$f":"\" \"&事業所情報!C3","v":" ABC株式会社"}]
[]
[null,null,"事業主氏名",null,null,null,{"$f":"\" \"&事業所情報!C6&\"   \"&事業所情報!C7","v":" 代表取締役社長   山田　太郎"}]
[]
[null,null,"電話",null,null,null,{"$f":"\" \"&事業所情報!C8","v":" 02-3232-1234"}]

{"sheet":"②","index":3,"n_rows":25,"n_cols":52,"rows_kept":25,"cut":false,"hidden":false,"merged":[[10,2,10,7],[0,2,0,5],[1,2,1,5],[4,7,4,11],[4,13,4,19],[9,2,9,3],[9,4,9,5],[0,7,1,20],[9,13,9,14],[9,15,9,16],[0,43,1,50],[9,6,9,7],[9,8,9,9],[9,10,9,12],[7,2,7,9],[7,10,7,12],[7,13,7,20],[22,34,22,44],[13,39,14,47],[4,31,5,31],[5,21,5,30],[5,13,5,19],[9,17,9,18],[9,19,9,20],[10,45,11,49],[10,43,10,44],[10,37,11,42],[4,21,4,30],[16,2,16,5],[18,2,18,5],[20,2,20,5],[22,2,22,5],[10,31,11,35],[10,19,10,25],[16,7,16,10],[18,6,18,19],[20,6,20,19],[22,6,22,17],[11,2,11,7],[11,10,11,16],[11,19,11,25],[11,26,11,29],[10,26,10,29],[10,10,10,16]]}
[null,null,"企業年金",null,null,null,null,"加入者氏名変更（訂正）報告書",null,null,null,null,null,null,null,null,null,null,null,null,null,null,null,null,null,null,null,null,null,null,null,null,null,null,null,null,null,null,null,null,null,null,null,"事業所用",null,null,null,null,null,null,null,2]
[null,null,"基　　金"]
[]
[]
[null,null,null,null,null,null,null,"契約番号",null,null,null,null,null,"事業所番号",null,null,null,null,null,null,null,"加入者番号",null,null,null,null,null,null,null,null,null,"CD"]
[null,null,null,null,null,null,null,8,0,4,2,8,null,{"$f":"①!N6","v":9876},null,null,null,null,null,null,null,{"$f":"①!V6","v":12345}]
[]
[null,null,"生年月日",null,null,null,null,null,null,null,"性別",null,null,"変更年月日"]
[null,null,null,null,null,"年",null,"月",null,"日",null,null,null,null,null,null,"年",null,"月",null,"日"]
[null,null,{"$f":"①!C10","v":"19"},null,{"$f":"①!E10","v":"77"},null,{"$f":"①!G10","v":9},null,{"$f":"①!I10","v":21},null,{"$f":"①!K10","v":"男"},null,null,{"$f":"①!N10","v":"20"},null,{"$f":"①!P10","v":"20"},null,{"$f":"①!R10","v":4},null,{"$f":"①!T10","v":1}]
[null,null,"加入者の氏名",null,null,null,null,null,"（ﾌﾘｶﾞﾅ）",null,{"$f":"①!K11","v":"タナカ"},null,null,null,null,null,null,null,null,{"$f":"①!T11","v":"イチロウ"},null,null,null,null,null,null,"変更前の",null,null,null,"(氏）",{"$f":"①!AF11","v":"山本"},null,null,null,null,"(名）",{"$f":"①!AL11","v":"一郎"},null,null,null,null,null,"備考",null,{"$f":"①!AT11","v":""}]
[null,null,"（変更後）",null,null,null,null,null,"（氏）",null,{"$f":"①!K12","v":"田中"},null,null,null,null,null,null,"（名）",null,{"$f":"①!T12","v":"一郎"},null,null,null,null,null,null,"氏　　名"]
[]
[null,null,null,null,null,null,null,null,null,null,null,null,null,null,null,null,null,null,null,null,null,null,null,null,null,null,null,null,null,null,null,null,null,null,null,null,null,null,null,{"$f":"入力_印刷!F1","v":"2020-04-20"}]
[]
[]
[null,null,"事業所所在地",null,null,null,"〒",{"$f":"事業所情報!C4","v":"123-4567"},null,null,null,{"$f":"事業所情報!C5","v":"山形県○○市○○３丁目２０番５号"}]
[]
[null,null,"事業所名称",null,null,null,{"$f":"\" \"&事業所情報!C3","v":" ABC株式会社"}]
[]
[null,null,"事業主氏名",null,null,null,{"$f":"\" \"&事業所情報!C6&\"   \"&事業所情報!C7&\"　　殿\"","v":" 代表取締役社長   山田　太郎　　殿"}]
[]
[null,null,"電話",null,null,null,{"$f":"\" \"&事業所情報!C8","v":" 02-3232-1234"}]
[]
[null,null,null,null,null,null,null,null,null,null,null,null,null,null,null,null,null,null,null,null,null,null,null,null,null,null,null,null,null,null,null,"企業年金基金理事長　",null,null,null,null,null,null,null,null,null,"印"]

{"sheet":"③","index":4,"n_rows":23,"n_cols":46,"rows_kept":23,"cut":false,"hidden":false,"merged":[[10,10,10,19],[11,10,11,19],[9,2,9,3],[22,34,22,44],[10,22,10,31],[11,22,11,31],[19,2,19,5],[21,2,21,5],[11,2,11,7],[10,2,10,7],[14,30,14,40],[7,2,7,9],[4,21,4,30],[4,31,5,31],[0,7,1,23],[0,35,1,44],[4,2,4,4],[0,2,0,5],[1,2,1,5],[4,7,4,11],[4,13,4,19]]}
[null,null,"企業年金",null,null,null,null,"加入者氏名変更（訂正）連絡表",null,null,null,null,null,null,null,null,null,null,null,null,null,null,null,null,null,null,null,null,null,null,null,null,null,null,null,"みずほ信託銀行用",null,null,null,null,null,null,null,null,null,3]
[null,null,"基　　金"]
[]
[]
[null,null,"届書番号",null,null,null,null,"契約番号",null,null,null,null,null,"事業所番号",null,null,null,null,null,null,null,"加入者番号",null,null,null,null,null,null,null,null,null,"CD"]
[null,null,1,8,5,null,null,8,0,4,2,8,null,{"$f":"MID(事業所情報!D2,1,1)","v":" "},{"$f":"MID(事業所情報!D2,2,1)","v":" "},{"$f":"MID(事業所情報!D2,3,1)","v":" "},{"$f":"MID(事業所情報!D2,4,1)","v":"9"},{"$f":"MID(事業所情報!D2,5,1)","v":"8"},{"$f":"MID(事業所情報!D2,6,1)","v":"7"},{"$f":"MID(事業所情報!D2,7,1)","v":"6"},null,{"$f":"VLOOKUP(入力_印刷!B2,入力_印刷!$A$5:$W$169,14,FALSE)","v":""},{"$f":"VLOOKUP(入力_印刷!B2,入力_印刷!$A$5:$W$169,15,FALSE)","v":""},{"$f":"VLOOKUP(入力_印刷!B2,入力_印刷!$A$5:$W$169,16,FALSE)","v":""},{"$f":"VLOOKUP(入力_印刷!B2,入力_印刷!$A$5:$W$169,17,FALSE)","v":""},{"$f":"VLOOKUP(入力_印刷!B2,入力_印刷!$A$5:$W$169,18,FALSE)","v":""},{"$f":"VLOOKUP(入力_印刷!B2,入力_印刷!$A$5:$W$169,19,FALSE)","v":"1"},{"$f":"VLOOKUP(入力_印刷!B2,入力_印刷!$A$5:$W$169,20,FALSE)","v":"2"},{"$f":"VLOOKUP(入力_印刷!B2,入力_印刷!$A$5:$W$169,21,FALSE)","v":"3"},{"$f":"VLOOKUP(入力_印刷!B2,入力_印刷!$A$5:$W$169,22,FALSE)","v":"4"},{"$f":"VLOOKUP(入力_印刷!B2,入力_印刷!$A$5:$W$169,23,FALSE)","v":"5"}]
[]
[null,null,"生年月日"]
[null,null,null,null,null,"年",null,"月",null,"日"]
[null,null,{"$f":"IF(①!C10=\"19\",\"Y\",IF(①!C10=\"20\",\"Z\",\"\"))","v":"Y"},null,{"$f":"IF(LEN(①!E10)=2,MID(①!E10,1,1),\"\")","v":"7"},{"$f":"RIGHT(①!E10,1)","v":"7"},{"$f":"IF(LEN(①!G10)=2,MID(①!G10,1,1),\"\")","v":""},{"$f":"RIGHT(①!G10,1)","v":"9"},{"$f":"IF(LEN(①!I10)=2,MID(①!I10,1,1),\"\")","v":"2"},{"$f":"RIGHT(①!I10,1)","v":"1"}]
[null,null,"加入者の氏名",null,null,null,null,null,"（ﾌﾘｶﾞﾅ）",null,{"$f":"①!K11","v":"タナカ"},null,null,null,null,null,null,null,null,null,null,null,{"$f":"①!T11","v":"イチロウ"}]
[null,null,"（変更後）",null,null,null,null,null,"（氏）",null,{"$f":"①!K12","v":"田中"},null,null,null,null,null,null,null,null,null,"（名）",null,{"$f":"①!T12","v":"一郎"}]
[]
[]
[null,null,null,null,null,null,null,null,null,null,null,null,null,null,null,null,null,null,null,null,null,null,null,null,null,null,null,null,null,null,{"$f":"入力_印刷!F1","v":"2020-04-20"},null,null,null,null,null,null,null,null,null,null,null,null,"提出"]
[]
[]
[]
[]
[]
[]
[]
[null,null,null,null,null,null,null,null,null,null,null,null,null,null,null,null,null,null,null,null,null,null,null,null,null,null,null,null,null,null,null,null,null,null,"    Ｇ＆Ｅみらい企業年金基金    "]

{"sheet":"Sheet1","index":5,"n_rows":2,"n_cols":5,"rows_kept":2,"cut":false,"hidden":true,"merged":[]}
[]
[null,"①\n３\n５\n７","③\n５\n７","３\n⑤\n７","３\n５\n⑦"]