{"text_format":"1","workbook":"xlsx","n_sheets":5,"sheets":["事業所情報","入力_印刷","①","②","③"],"not_rendered":{"charts":0,"images":0,"macros":1,"external_links":0,"defined_names":3,"comments":0,"pivot_tables":0},"unopened":[],"bounds":{"document_bytes":16777216,"sheet_cells":100000,"rows_first":2000,"rows_last":500,"rows_between":2000,"halvings":0,"cell_chars":16384,"cell_head_chars":4096},"cells_cut":0,"cells_raw":0,"read":"whole","date_system":"1900"}

{"sheet":"事業所情報","index":0,"n_rows":8,"n_cols":3,"rows_kept":8,"cut":false,"hidden":false,"merged":[]}
["事業所情報"]
[null,"事業所番号",9876]
[null,"事業所名","ABC株式会社"]
[null,"郵便番号","123-4567"]
[null,"住所","山形県○○市○○３丁目２０番５号"]
[null,"代表者肩書き","代表取締役社長"]
[null,"代表者名","山田　太郎"]
[null,"電話番号","02-3232-1234"]

{"sheet":"入力_印刷","index":1,"n_rows":156,"n_cols":25,"rows_kept":156,"cut":false,"hidden":false,"merged":[[0,8,1,9],[2,1,2,10],[2,12,2,16],[4,0,5,0],[4,1,4,2],[4,3,4,4],[4,5,5,5],[4,6,5,6],[4,7,5,7],[4,8,5,8],[4,15,5,15],[4,16,5,16],[4,17,5,17],[4,9,5,9],[4,10,5,10],[4,11,5,11],[4,12,5,12],[4,13,5,13],[4,14,5,14]]}
[null,"印刷指定",null,"届出に記載される提出日",null,null,"2020-04-20",null,"資格喪失時届",null,"基加選択"]
[null,1,"～",3,{"$f":"+D2-B2+1","v":3},null,{"$f":"IF(E2>3,\"印刷は3件まで\",\"\")","v":""},null,null,null,"第１年金のみ"]
[null,"必須項目",null,null,null,null,null,null,null,null,null,null,"追加入力",null,null,null,null,"提出確認"]
[1,2,3,4,5,6,7,8,9,10,11,12,13,14,15,16,17]
["通し番号","漢字氏名",null,"カタカナ氏名",null,"西暦","生年月日","性別\n男=5\n女=6","  　　資格喪失年月日\n\n退職、条件非適合：当該日の翌日\n65歳到達：誕生日前日\n休職：休職した当日\n死亡：死亡の翌日\n事業所脱退：脱退の翌日","加入者番号","転出に該当する\n場合のみ「1」を入力","追加入力確認","喪失事由選択\n\n65歳到達は\n「定年」","喪失事由コード\n(自動判別）","郵便番号\n(ハイフン無）","住所","住所（フリガナ）","提出日"]
[null,"姓","名","姓","名"]
[1,"瑞穂","太郎","ミズホ","タロウ",{"$f":"IF(TYPE(B7)=1,\"\",TEXT(G7,\"YYYY/MM/DD\"))","v":"1975/04/28"},"1975-04-28",5,"2020-04-20",12354,null,{"$f":"IF(TYPE(B7)=1,\"\",IF(K7=1,\"追加入力不要\",IF(OR(COUNTBLANK(O7:P7)=2,AND(TYPE(B7)=2,COUNTBLANK(K7)=1,COUNTBLANK(M7)=1)=TRUE)=TRUE,\"喪失事由・住所を入力\",\"\")))","v":""},"会社都合",{"$f":"IF(M7=$Y$7,21,IF(M7=$Y$8,31,IF(M7=$Y$9,11,IF(M7=$Y$10,41,IF(M7=$Y$11,93,\"\")))))","v":31},9235678,"宮城県仙台市○○町1-1-1　ハウス田中201","ミヤギケンセンダイシマルマルマチ　　　　　　タナカ","2020-04-20",null,null,null,null,null,null,"定年"]
[{"$f":"IF(TYPE(B8)=2,+A7+1,\"\")","v":2},"山田","花子","ヤマダ","ハナコ",{"$f":"IF(TYPE(B8)=1,\"\",TEXT(G8,\"YYYY/MM/DD\"))","v":"1997/11/05"},"1997-11-05",6,"2020-04-01",2530,1,{"$f":"IF(TYPE(B8)=1,\"\",IF(K8=1,\"追加入力不要\",IF(OR(COUNTBLANK(O8:P8)=2,AND(TYPE(B8)=2,COUNTBLANK(K8)=1,COUNTBLANK(M8)=1)=TRUE)=TRUE,\"喪失事由・住所を入力\",\"\")))","v":"追加入力不要"},null,{"$f":"IF(M8=$Y$7,21,IF(M8=$Y$8,31,IF(M8=$Y$9,11,IF(M8=$Y$10,41,IF(M8=$Y$11,93,\"\")))))","v":""},null,null,null,"2020-04-20",null,null,null,null,null,null,"会社都合"]
[{"$f":"IF(TYPE(B9)=2,+A8+1,\"\")","v":3},"鈴木","一郎","スズキ","イチロウ",{"$f":"IF(TYPE(B9)=1,\"\",TEXT(G9,\"YYYY/MM/DD\"))","v":"1953/06/14"},"1953-06-14",5,"2020-04-01",54321,null,{"$f":"IF(TYPE(B9)=1,\"\",IF(K9=1,\"追加入力不要\",IF(OR(COUNTBLANK(O9:P9)=2,AND(TYPE(B9)=2,COUNTBLANK(K9)=1,COUNTBLANK(M9)=1)=TRUE)=TRUE,\"喪失事由・住所を入力\",\"\")))","v":""},"定年",21,9875432,"鹿児島県□□郡□□町大字△字○333","カゴシマケンシカクシカクグンシカクシカクマチオオアザサンカクマル","2020-04-20",null,null,null,null,null,null,"自己都合"]
[4,"佐藤","ゆり子","サトウ","ユリコ","2000/01/01","2000-01-01",6,"2020-04-28",1000001234,null,"","自己都合",11,5139876,"三重県○○市○○１丁目30番5号","ミエケンマルマルシマルマル　　チョウメ　　バン　　ゴウ",null,null,null,null,null,null,null,"死亡"]
[5,"年金","要子","ネンキン","ヨウコ","1978/05/19","1978-05-19",6,"2020-04-22",825,null,"","死亡",41,123456,"北海道札幌市△△△2-2-2　グレートレジデンス508","ホッカイドウサッポロシサンカクサンカク",null,null,null,null,null,null,null,"休職"]
[6,"高橋","憲一","タカハシ","ケンイチ","1999/10/09","1999-10-09",5,"2020-04-01",15,1,"追加入力不要",null,""]
["",null,null,null,null,"",null,null,null,null,null,"",null,""]
["",null,null,null,null,"",null,null,null,null,null,"",null,""]
["",null,null,null,null,"",null,null,null,null,null,"",null,""]
["",null,null,null,null,"",null,null,null,null,null,"",null,""]
["",null,null,null,null,"",null,null,null,null,null,"",null,""]
["",null,null,null,null,"",null,null,null,null,null,"",null,""]
["",null,null,null,null,"",null,null,null,null,null,"",null,""]
["",null,null,null,null,"",null,null,null,null,null,"",null,""]
{"$rows_left_out":137}
{"sheet":"①","index":2,"n_rows":51,"n_cols":67,"rows_kept":51,"cut":false,"hidden":false,"merged":[[0,1,0,5],[0,7,1,22],[0,59,1,65],[0,66,1,67],[1,1,1,5],[8,3,8,27],[8,28,8,35],[8,36,9,37],[8,38,8,44],[8,45,9,68],[9,3,9,27],[9,28,9,35],[9,38,9,44],[4,14,5,20],[4,8,5,12],[4,53,4,55],[4,56,4,58],[4,59,4,61],[4,62,4,64],[4,65,4,67],[14,3,15,5],[14,6,15,19],[14,20,15,22],[14,23,15,36],[14,37,15,39],[14,40,15,53],[10,41,10,68],[11,35,11,36],[11,41,12,68],[12,35,12,36],[13,3,13,19],[13,20,13,36],[13,37,13,53],[10,3,12,22],[10,23,12,24],[10,25,12,26],[10,27,12,34],[10,35,10,36],[10,37,12,40],[17,3,17,5],[17,6,17,15],[17,19,17,27],[17,28,19,29],[17,36,19,37],[18,3,18,4],[18,6,19,15],[18,19,19,27],[18,30,19,31],[18,32,19,33],[18,34,19,35],[18,38,19,38],[18,39,19,40],[18,41,19,42],[18,43,19,44],[20,3,22,4],[20,5,22,6],[20,7,22,8],[20,9,22,10],[20,11,22,12],[20,44,20,68],[21,35,22,36],[21,41,21,43],[21,44,22,68],[20,13,22,14],[20,15,22,16],[20,17,22,18],[20,19,22,20],[20,21,22,22],[20,23,20,24],[23,3,23,5],[23,20,23,22],[23,37,23,39],[24,3,24,5],[24,20,24,22],[24,37,24,39],[20,25,22,26],[20,37,22,40],[20,41,20,43],[26,3,26,5],[26,6,26,15],[26,19,26,27],[26,28,28,29],[26,36,28,37],[27,3,27,4],[27,6,28,15],[27,19,28,27],[27,30,28,31],[27,32,28,33],[27,34,28,35],[27,38,28,38],[27,39,28,40],[27,41,28,42],[27,43,28,44],[29,3,31,4],[29,5,31,6],[29,7,31,8],[29,9,31,10],[29,11,31,12],[29,44,29,68],[30,35,31,36],[30,41,30,43],[30,44,31,68],[29,13,31,14],[29,15,31,16],[29,17,31,18],[29,19,31,20],[29,21,31,22],[29,23,29,24],[32,3,32,5],[32,20,32,22],[32,37,32,39],[33,3,33,5],[33,20,33,22],[33,37,33,39],[29,25,31,26],[29,37,31,40],[29,41,29,43],[35,3,35,5],[35,6,35,15],[35,19,35,27],[35,28,37,29],[35,36,37,37],[36,3,36,4],[36,6,37,15],[36,19,37,27],[36,30,37,31],[36,32,37,33],[36,34,37,35],[36,38,37,38],[36,39,37,40],[36,41,37,42],[36,43,37,44],[38,3,40,4],[38,5,40,6],[38,7,40,8],[38,9,40,10],[38,11,40,12],[38,44,38,68],[39,35,40,36],[39,41,39,43],[39,44,40,68],[38,13,40,14],[38,15,40,16],[38,17,40,18],[38,19,40,20],[38,21,40,22],[38,23,38,24],[41,3,41,5],[41,20,41,22],[41,37,41,39],[42,3,42,5],[42,20,42,22],[42,37,42,39],[38,25,40,26],[38,37,40,40],[38,41,38,43],[49,3,49,7],[49,8,49,22],[49,23,49,28],[50,3,50,7],[50,8,50,32],[45,52,45,64],[47,3,47,7],[47,8,47,11],[47,12,47,32],[48,3,48,7],[48,8,48,32],[45,3,45,24]]}
[null,"企　業　年　金",null,null,null,null,null,"加入者資格喪失届",null,null,null,null,null,null,null,null,null,null,null,null,null,null,null,null,null,null,null,null,null,null,null,null,null,null,null,null,null,null,null,null,null,null,null,null,null,null,null,null,null,null,null,null,null,null,null,null,null,null,null,"企業年金基金用",null,null,null,null,null,null,1]
[null,"基　　　　　　金"]
[]
[null,null,null,null,null,null,null,null,null,null,null,null,null,null,null,null,null,null,null,null,null,null,null,null,null,null,null,null,null,null,null,null,null,null,null,null,null,null,null,null,null,null,null,null,null,null,null,null,null,null,null,null,null,null,null,null,null,null,null,null,null,"事","→","基"]
[null,null,null,null,null,null,null,null,"契約番号",null,null,null,null,null,"事業所番号",null,null,null,null,null,null,null,null,null,null,null,null,null,null,null,null,null,null,null,null,null,null,null,null,null,null,null,null,null,null,null,null,null,null,null,null,null,null,"常務理事",null,null,"事務長",null,null,"課（係）長",null,null,null,null,null,"係"]
[]
[null,null,null,null,null,null,null,null,8,0,4,2,8,null,null,null,null,{"$f":"IF(事業所情報!C2<999,\"\",LEFT(事業所情報!C2,1))","v":"9"},{"$f":"LEFT(RIGHT(事業所情報!C2,3))","v":"8"},{"$f":"LEFT(RIGHT(事業所情報!C2,2))","v":"7"},{"$f":"RIGHT(事業所情報!C2,1)","v":"6"}]
[]
[null,null,null,"フ　　　リ　　　ガ　　　ナ",null,null,null,null,null,null,null,null,null,null,null,null,null,null,null,null,null,null,null,null,null,null,null,null,"生　年　月　日",null,null,null,null,null,null,null,"性別",null,"資格喪失年月日",null,null,null,null,null,null,"備　　　　　考"]
[null,null,null,"加　入　者　の　氏　名",null,null,null,null,null,null,null,null,null,null,null,null,null,null,null,null,null,null,null,null,null,null,null,null,"（西暦）",null,null,null,null,null,null,null,null,null,"（西暦）"]
[null,null,null,"加　入　者　番　号",null,null,null,null,null,null,null,null,null,null,null,null,null,null,null,null,null,null,null,"CD",null,"転出",null,null,null,null,null,null,null,null,null,"喪　失",null,"郵便番号",null,null,null,"フ　リ　ガ　ナ"]
[null,null,null,null,null,null,null,null,null,null,null,null,null,null,null,null,null,null,null,null,null,null,null,null,null,null,null,null,null,null,null,null,null,null,null,"事　由",null,null,null,null,null,"喪　失　後　の　現　住　所　（または連絡先）"]
[null,null,null,null,null,null,null,null,null,null,null,null,null,null,null,null,null,null,null,null,null,null,null,null,null,null,null,null,null,null,null,null,null,null,null,"コード"]
[null,null,null,"第　　　　　一",null,null,null,null,null,null,null,null,null,null,null,null,null,null,null,null,"第　　　　　二",null,null,null,null,null,null,null,null,null,null,null,null,null,null,null,null,"第　　　　　三"]
[null,null,null,"喪失の\n要　否",null,null,"最終標準給与月額",null,null,null,null,null,null,null,null,null,null,null,null,null,"喪失の\n要　否",null,null,"最終標準給与月額",null,null,null,null,null,null,null,null,null,null,null,null,null,"喪失の\n要　否",null,null,"最終標準給与月額"]
[]
[]
[null,null,null,"（フリガナ）",null,null,{"$f":"VLOOKUP(印刷開始番号,入力データ,4,0)","v":"ミズホ"},null,null,null,null,null,null,null,null,null,null,null,null,{"$f":"VLOOKUP(印刷開始番号,入力データ,5,0)","v":"タロウ"},null,null,null,null,null,null,null,null,{"$f":"\"　\"&IF(LEFT(VLOOKUP(印刷開始番号,入力データ,入力_印刷!$F$4,0),2)=\"19\",\"19\",\"20\")","v":"　19"},null,null,"年",null,"月",null,"日",{"$f":"IF(VLOOKUP(印刷開始番号,入力データ,8,0)=5,\"男\",IF(VLOOKUP(印刷開始番号,入力データ,8,0)=6,\"女\",\"\"))","v":"男"},null,null,null,"年",null,"月",null,"日"]
[null,null,null,"（氏）",null,null,{"$f":"VLOOKUP(印刷開始番号,入力データ,2,0)","v":"瑞穂"},null,null,null,null,null,null,null,null,null,"（名）",null,null,{"$f":"VLOOKUP(印刷開始番号,入力データ,3,0)","v":"太郎"},null,null,null,null,null,null,null,null,null,null,{"$f":"MID(VLOOKUP(印刷開始番号,入力データ,入力_印刷!$F$4,0),3,2)","v":"75"},null,{"$f":"TEXT(VLOOKUP(印刷開始番号,入力データ,入力_印刷!$F$4,0),\"mm\")","v":"04"},null,{"$f":"TEXT(VLOOKUP(印刷開始番号,入力データ,入力_印刷!$F$4,0),\"dd\")","v":"28"},null,null,null,20,{"$f":"TEXT(VLOOKUP(印刷開始番号,入力データ,入力_印刷!$I$4,0),\"yy\")","v":"20"},null,{"$f":"TEXT(VLOOKUP(印刷開始番号,入力データ,入力_印刷!$I$4,0),\"mm\")","v":"04"},null,{"$f":"TEXT(VLOOKUP(印刷開始番号,入力データ,入力_印刷!$I$4,0),\"dd\")","v":"20"}]
[]
{"$rows_left_out":32}
{"sheet":"②","index":3,"n_rows":44,"n_cols":67,"rows_kept":44,"cut":false,"hidden":false,"merged":[[0,1,0,5],[0,7,1,23],[0,59,1,65],[0,66,1,67],[1,1,1,5],[3,4,3,6],[3,8,3,12],[3,14,3,20],[6,36,7,37],[6,38,6,44],[6,45,7,68],[7,3,7,27],[7,28,7,35],[7,38,7,44],[4,17,5,17],[4,18,5,18],[4,19,5,19],[4,20,5,20],[6,3,6,27],[6,28,6,35],[4,4,5,4],[4,5,5,5],[4,6,5,6],[4,14,5,14],[4,15,5,15],[4,16,5,16],[12,3,13,5],[12,6,13,19],[12,20,13,22],[12,23,13,36],[12,37,13,39],[12,40,13,53],[8,41,8,68],[9,35,9,36],[9,41,10,68],[10,35,10,36],[11,3,11,19],[11,20,11,36],[11,37,11,53],[8,3,10,22],[8,23,10,24],[8,25,10,26],[8,27,10,34],[8,35,8,36],[8,37,10,40],[4,8,5,8],[4,9,5,9],[4,10,5,10],[15,3,15,5],[15,6,15,15],[15,19,15,27],[15,28,17,29],[15,36,17,37],[16,3,16,4],[16,6,17,15],[16,19,17,27],[16,30,17,31],[16,32,17,33],[16,34,17,35],[16,38,17,38],[16,39,17,40],[16,41,17,42],[16,43,17,44],[18,3,20,4],[18,5,20,6],[18,7,20,8],[18,9,20,10],[18,11,20,12],[18,44,18,68],[19,35,20,36],[19,41,19,43],[19,44,20,68],[18,13,20,14],[18,15,20,16],[18,17,20,18],[18,19,20,20],[18,21,20,22],[18,23,18,24],[21,3,21,5],[21,20,21,22],[21,37,21,39],[22,3,22,5],[22,20,22,22],[22,37,22,39],[18,25,20,26],[18,37,20,40],[18,41,18,43],[24,3,24,5],[24,6,24,15],[24,19,24,27],[24,28,26,29],[24,36,26,37],[25,3,25,4],[25,6,26,15],[25,19,26,27],[25,30,26,31],[25,32,26,33],[25,34,26,35],[25,38,26,38],[25,39,26,40],[25,41,26,42],[25,43,26,44],[27,3,29,4],[27,5,29,6],[27,7,29,8],[27,9,29,10],[27,11,29,12],[27,44,27,68],[28,35,29,36],[28,41,28,43],[28,44,29,68],[27,13,29,14],[27,15,29,16],[27,17,29,18],[27,19,29,20],[27,21,29,22],[27,23,27,24],[30,3,30,5],[30,20,30,22],[30,37,30,39],[31,3,31,5],[31,20,31,22],[31,37,31,39],[27,25,29,26],[27,37,29,40],[27,41,27,43],[34,41,35,42],[34,43,35,44],[36,3,38,4],[36,5,38,6],[36,7,38,8],[36,9,38,10],[36,11,38,12],[33,3,33,5],[33,6,33,15],[33,19,33,27],[33,28,35,29],[33,36,35,37],[34,3,34,4],[34,6,35,15],[34,19,35,27],[34,30,35,31],[34,32,35,33],[34,34,35,35],[4,11,5,11],[4,12,5,12],[43,52,43,64],[39,3,39,5],[39,20,39,22],[39,37,39,39],[40,3,40,5],[40,20,40,22],[40,37,40,39],[36,25,38,26],[36,37,38,40],[36,41,36,43],[36,44,36,68],[37,35,38,36],[37,41,37,43],[37,44,38,68],[36,13,38,14],[36,15,38,16],[36,17,38,18],[36,19,38,20],[36,21,38,22],[36,23,36,24],[34,38,35,38],[34,39,35,40]]}
[null,"企業年金基金",null,null,null,null,null,"加　入　者　資　格　　喪　失　通　知　書",null,null,null,null,null,null,null,null,null,null,null,null,null,null,null,null,null,null,null,null,null,null,null,null,null,null,null,null,null,null,null,null,null,null,null,null,null,null,null,null,null,null,null,null,null,null,null,null,null,null,null,"みずほ信託銀行用",null,null,null,null,null,null,2]
[null,"基　　　　　　金"]
[]
[null,null,null,null,"届書番号",null,null,null,"契約番号",null,null,null,null,null,"事業所番号",null,null,null,null,null,null,null,null,null,null,null,null,null,null,null,null,null,null,null,null,null,null,null,null,null,null,null,null,null,null,null,null,null,null,null,null,null,null,null,null,null,null,null,null,null,"事","→","基","→","信"]
[null,null,null,null,1,7,4,null,8,0,4,2,8,null,null,null,null,{"$f":"+①!R7","v":"9"},{"$f":"LEFT(RIGHT(事業所情報!C2,3))","v":"8"},{"$f":"+①!T7","v":"7"},{"$f":"+①!U7","v":"6"}]
[]
[null,null,null,"フ　　　リ　　　ガ　　　ナ",null,null,null,null,null,null,null,null,null,null,null,null,null,null,null,null,null,null,null,null,null,null,null,null,"生　年　月　日",null,null,null,null,null,null,null,"性別",null,"資格喪失年月日",null,null,null,null,null,null,"備　　　　　考"]
[null,null,null,"加　入　者　の　氏　名",null,null,null,null,null,null,null,null,null,null,null,null,null,null,null,null,null,null,null,null,null,null,null,null,"（西暦）",null,null,null,null,null,null,null,null,null,"（西暦）"]
[null,null,null,"加　入　者　番　号",null,null,null,null,null,null,null,null,null,null,null,null,null,null,null,null,null,null,null,"CD",null,"転出",null,null,null,null,null,null,null,null,null,"喪　失",null,"郵便番号",null,null,null,"フ　リ　ガ　ナ"]
[null,null,null,null,null,null,null,null,null,null,null,null,null,null,null,null,null,null,null,null,null,null,null,null,null,null,null,null,null,null,null,null,null,null,null,"事　由",null,null,null,null,null,"喪　失　後　の　現　住　所　（または連絡先）"]
[null,null,null,null,null,null,null,null,null,null,null,null,null,null,null,null,null,null,null,null,null,null,null,null,null,null,null,null,null,null,null,null,null,null,null,"コード"]
[null,null,null,"第　　　　　一",null,null,null,null,null,null,null,null,null,null,null,null,null,null,null,null,"第　　　　　二",null,null,null,null,null,null,null,null,null,null,null,null,null,null,null,null,"第　　　　　三"]
[null,null,null,"喪失の\n要　否",null,null,"最終標準給与月額",null,null,null,null,null,null,null,null,null,null,null,null,null,"喪失の\n要　否",null,null,"最終標準給与月額",null,null,null,null,null,null,null,null,null,null,null,null,null,"喪失の\n要　否",null,null,"最終標準給与月額"]
[]
[]
[null,null,null,"（フリガナ）",null,null,{"$f":"①!G18","v":"ミズホ"},null,null,null,null,null,null,null,null,null,null,null,null,{"$f":"①!T18","v":"タロウ"},null,null,null,null,null,null,null,null,{"$f":"IF(①!AC18=\"　19\",\"Y\",IF(①!AC18=\"　20\",\"Z\",\"\"))","v":"Y"},null,null,"年",null,"月",null,"日",{"$f":"IF(①!AK18=\"男\",5,IF(①!AK18=\"女\",6,\"\"))","v":5},null,null,null,"年",null,"月",null,"日"]
[null,null,null,"（氏）",null,null,{"$f":"①!G19","v":"瑞穂"},null,null,null,null,null,null,null,null,null,"（名）",null,null,{"$f":"①!T19","v":"太郎"},null,null,null,null,null,null,null,null,null,null,{"$f":"①!AE19","v":"75"},null,{"$f":"①!AG19","v":"04"},null,{"$f":"①!AI19","v":"28"},null,null,null,"Ｚ",{"$f":"①!AN19","v":"20"},null,{"$f":"①!AP19","v":"04"},null,{"$f":"①!AR19","v":"20"}]
[]
[null,null,null,{"$f":"①!D21","v":""},null,{"$f":"①!F21","v":""},null,{"$f":"①!H21","v":""},null,{"$f":"①!J21","v":""},null,{"$f":"①!L21","v":""},null,{"$f":"①!N21","v":"1"},null,{"$f":"①!P21","v":"2"},null,{"$f":"①!R21","v":"3"},null,{"$f":"①!T21","v":"5"},null,{"$f":"①!V21","v":"4"},null,"ＣＤ",null,{"$f":"IF(①!Z21=\"転出\",9,\"\")","v":""},null,null,null,null,null,null,null,null,null,"喪失事由",null,{"$f":"①!AL21","v":"923-5678"},null,null,null,"フリガナ",null,null,{"$f":"①!AS21","v":"ミヤギケンセンダイシマルマルマチ　　　　　　タナカ"}]
[null,null,null,null,null,null,null,null,null,null,null,null,null,null,null,null,null,null,null,null,null,null,null,null,null,null,null,null,null,null,null,null,null,null,null,{"$f":"①!AJ22","v":31},null,null,null,null,null,"（現住所）",null,null,{"$f":"①!AS22","v":"宮城県仙台市○○町1-1-1　ハウス田中201"}]
{"$rows_left_out":25}
{"sheet":"③","index":4,"n_rows":49,"n_cols":67,"rows_kept":49,"cut":false,"hidden":false,"merged":[[0,1,0,5],[0,7,1,22],[0,59,1,65],[0,66,1,67],[1,1,1,5],[3,8,3,12],[3,14,3,20],[4,20,5,20],[6,3,6,27],[6,28,6,35],[6,36,7,37],[6,38,6,44],[6,45,7,68],[7,3,7,27],[7,28,7,35],[7,38,7,44],[4,14,5,14],[4,15,5,15],[4,16,5,16],[4,17,5,17],[4,18,5,18],[4,19,5,19],[4,8,5,8],[4,9,5,9],[12,3,13,5],[12,6,13,19],[12,20,13,22],[12,23,13,36],[12,37,13,39],[12,40,13,53],[8,41,8,68],[9,35,9,36],[9,41,10,68],[10,35,10,36],[11,3,11,19],[11,20,11,36],[11,37,11,53],[8,3,10,22],[8,23,10,24],[8,25,10,26],[8,27,10,34],[8,35,8,36],[8,37,10,40],[15,3,15,5],[15,6,15,15],[15,19,15,27],[15,28,17,29],[15,36,17,37],[16,3,16,4],[16,6,17,15],[16,19,17,27],[16,30,17,31],[16,32,17,33],[16,34,17,35],[16,38,17,38],[16,39,17,40],[16,41,17,42],[16,43,17,44],[18,3,20,4],[18,5,20,6],[18,7,20,8],[18,9,20,10],[18,11,20,12],[18,44,18,68],[19,35,20,36],[19,41,19,43],[19,44,20,68],[18,13,20,14],[18,15,20,16],[18,17,20,18],[18,19,20,20],[18,21,20,22],[18,23,18,24],[21,3,21,5],[21,20,21,22],[21,37,21,39],[22,3,22,5],[22,20,22,22],[22,37,22,39],[18,25,20,26],[18,37,20,40],[18,41,18,43],[24,3,24,5],[24,6,24,15],[24,19,24,27],[24,28,26,29],[24,36,26,37],[25,3,25,4],[25,6,26,15],[25,19,26,27],[25,30,26,31],[25,32,26,33],[25,34,26,35],[25,38,26,38],[25,39,26,40],[25,41,26,42],[25,43,26,44],[27,3,29,4],[27,5,29,6],[27,7,29,8],[27,9,29,10],[27,11,29,12],[27,44,27,68],[28,35,29,36],[28,41,28,43],[28,44,29,68],[27,13,29,14],[27,15,29,16],[27,17,29,18],[27,19,29,20],[27,21,29,22],[27,23,27,24],[30,3,30,5],[30,20,30,22],[30,37,30,39],[31,3,31,5],[31,20,31,22],[31,37,31,39],[27,25,29,26],[27,37,29,40],[27,41,27,43],[33,3,33,5],[33,6,33,15],[33,19,33,27],[33,28,35,29],[33,36,35,37],[34,3,34,4],[34,6,35,15],[34,19,35,27],[34,30,35,31],[34,32,35,33],[34,34,35,35],[34,39,35,40],[34,41,35,42],[34,43,35,44],[36,3,38,4],[36,5,38,6],[36,7,38,8],[36,9,38,10],[36,11,38,12],[36,44,36,68],[37,35,38,36],[37,41,37,43],[37,44,38,68],[36,13,38,14],[36,15,38,16],[36,17,38,18],[36,19,38,20],[36,21,38,22],[36,23,36,24],[4,10,5,10],[4,11,5,11],[4,12,5,12],[47,3,47,7],[47,8,47,22],[47,23,47,28],[48,3,48,7],[48,8,48,32],[43,52,43,64],[45,3,45,7],[45,8,45,11],[45,12,45,32],[46,3,46,7],[46,8,46,32],[39,3,39,5],[39,20,39,22],[39,37,39,39],[40,3,40,5],[40,20,40,22],[40,37,40,39],[36,25,38,26],[36,37,38,40],[36,41,36,43],[34,38,35,38]]}
[null,"企　業　年　金",null,null,null,null,null,"加入者資格喪失通知書",null,null,null,null,null,null,null,null,null,null,null,null,null,null,null,null,null,null,null,null,null,null,null,null,null,null,null,null,null,null,null,null,null,null,null,null,null,null,null,null,null,null,null,null,null,null,null,null,null,null,null,"事　業　所　用",null,null,null,null,null,null,3]
[null,"基　　　　　　金"]
[]
[null,null,null,null,null,null,null,null,"契約番号",null,null,null,null,null,"事業所番号",null,null,null,null,null,null,null,null,null,null,null,null,null,null,null,null,null,null,null,null,null,null,null,null,null,null,null,null,null,null,null,null,null,null,null,null,null,null,null,null,null,null,null,null,null,"事","→","基","→","事"]
[null,null,null,null,null,null,null,null,8,0,4,2,8,null,null,null,null,{"$f":"②!R5","v":"9"},{"$f":"②!S5","v":"8"},{"$f":"②!T5","v":"7"},{"$f":"②!U5","v":"6"}]
[]
[null,null,null,"フ　　　リ　　　ガ　　　ナ",null,null,null,null,null,null,null,null,null,null,null,null,null,null,null,null,null,null,null,null,null,null,null,null,"生　年　月　日",null,null,null,null,null,null,null,"性別",null,"資格喪失年月日",null,null,null,null,null,null,"備　　　　　考"]
[null,null,null,"加　入　者　の　氏　名",null,null,null,null,null,null,null,null,null,null,null,null,null,null,null,null,null,null,null,null,null,null,null,null,"（西暦）",null,null,null,null,null,null,null,null,null,"（西暦）"]
[null,null,null,"加　入　者　番　号",null,null,null,null,null,null,null,null,null,null,null,null,null,null,null,null,null,null,null,"CD",null,"転出",null,null,null,null,null,null,null,null,null,"喪　失",null,"郵便番号",null,null,null,"フ　リ　ガ　ナ"]
[null,null,null,null,null,null,null,null,null,null,null,null,null,null,null,null,null,null,null,null,null,null,null,null,null,null,null,null,null,null,null,null,null,null,null,"事　由",null,null,null,null,null,"喪　失　後　の　現　住　所　（または連絡先）"]
[null,null,null,null,null,null,null,null,null,null,null,null,null,null,null,null,null,null,null,null,null,null,null,null,null,null,null,null,null,null,null,null,null,null,null,"コード"]
[null,null,null,"第　　　　　一",null,null,null,null,null,null,null,null,null,null,null,null,null,null,null,null,"第　　　　　二",null,null,null,null,null,null,null,null,null,null,null,null,null,null,null,null,"第　　　　　三"]
[null,null,null,"喪失の\n要　否",null,null,"最終標準給与月額",null,null,null,null,null,null,null,null,null,null,null,null,null,"喪失の\n要　否",null,null,"最終標準給与月額",null,null,null,null,null,null,null,null,null,null,null,null,null,"喪失の\n要　否",null,null,"最終標準給与月額"]
[]
[]
[null,null,null,"（フリガナ）",null,null,{"$f":"①!G18","v":"ミズホ"},null,null,null,null,null,null,null,null,null,null,null,null,{"$f":"①!T18","v":"タロウ"},null,null,null,null,null,null,null,null,{"$f":"①!AC18","v":"　19"},null,null,"年",null,"月",null,"日",{"$f":"①!AK18","v":"男"},null,null,null,"年",null,"月",null,"日"]
[null,null,null,"（氏）",null,null,{"$f":"①!G19","v":"瑞穂"},null,null,null,null,null,null,null,null,null,"（名）",null,null,{"$f":"①!T19","v":"太郎"},null,null,null,null,null,null,null,null,null,null,{"$f":"①!AE19","v":"75"},null,{"$f":"①!AG19","v":"04"},null,{"$f":"①!AI19","v":"28"},null,null,null,20,{"$f":"①!AN19","v":"20"},null,{"$f":"①!AP19","v":"04"},null,{"$f":"①!AR19","v":"20"}]
[]
[null,null,null,{"$f":"①!D21","v":""},null,{"$f":"①!F21","v":""},null,{"$f":"①!H21","v":""},null,{"$f":"①!J21","v":""},null,{"$f":"①!L21","v":""},null,{"$f":"①!N21","v":"1"},null,{"$f":"①!P21","v":"2"},null,{"$f":"①!R21","v":"3"},null,{"$f":"①!T21","v":"5"},null,{"$f":"①!V21","v":"4"},null,"ＣＤ",null,{"$f":"①!Z21","v":""},null,null,null,null,null,null,null,null,null,"喪失事由",null,{"$f":"①!AL21","v":"923-5678"},null,null,null,"フリガナ",null,null,{"$f":"①!AS21","v":"ミヤギケンセンダイシマルマルマチ　　　　　　タナカ"}]
[null,null,null,null,null,null,null,null,null,null,null,null,null,null,null,null,null,null,null,null,null,null,null,null,null,null,null,null,null,null,null,null,null,null,null,{"$f":"①!AJ22","v":31},null,null,null,null,null,"（現住所）",null,null,{"$f":"①!AS22","v":"宮城県仙台市○○町1-1-1　ハウス田中201"}]
{"$rows_left_out":29}